My environment is:
Linux - Redhat 6.0
RedHat Secure Server 3.0
-------------------------
Problem: When trying to install PHP-4.0b3 it Dies on $make giving the follow error information - what do I need to do to fix it?
--------------------------
Here is my Config line:
./configure --with-apxs=/usr/local/etc/httpd/bin/apxs --with-config-file-path=/etc/httpd --with-mysql=/usr/local/mysql --with-system-regex
=-=-=-=-=-=-=-=-=-=-=-=-=-=-=-=-=-=-=-
In file included from apache.c:22:
../../php.h:175: ap_config_auto.h: No such file or directory
../../php.h:179: ap_config.h: No such file or directory
../../php.h:189: ap_compat.h: No such file or directory
../../php.h:191: httpd.h: No such file or directory
../../php.h:192: http_main.h: No such file or directory
../../php.h:193: http_core.h: No such file or directory
../../php.h:194: http_request.h: No such file or directory
../../php.h:195: http_protocol.h: No such file or directory
../../php.h:196: http_config.h: No such file or directory
../../php.h:197: http_log.h: No such file or directory
apache.c:39: http_request.h: No such file or directory
make[3]: *** [apache.lo] Error 1
make[3]: Leaving directory `/tmp/php-4.0b3/ext/apache'
make[2]: *** [all-recursive] Error 1
make[2]: Leaving directory `/tmp/php-4.0b3/ext'
make[1]: *** [all-recursive] Error 1
make[1]: Leaving directory `/tmp/php-4.0b3'
make: *** [all-recursive-am] Error 2