1. No Profile Picture
    Junior Member
    Devshed Newbie (0 - 499 posts)

    Join Date
    Sep 2000
    Rep Power
    Redhat6.2 +PHP4.0.2
    gd.c: In function `php_if_imagecreatefromgif':
    gd.c:500: `gdImageCreateFromGif' undeclared (first use in this function)
    gd.c:500: (Each undeclared identifier is reported only once
    gd.c:500: for each function it appears in.)
    gd.c: In function `php_if_imagegif':
    gd.c:657: `gdImageGif' undeclared (first use in this function)
    make[3]: *** [gd.lo] Error 1
    make[3]: Leaving directory `/tmp/download/php-4.0.2/ext/gd'
    make[2]: *** [all-recursive] Error 1
    make[2]: Leaving directory `/tmp/download/php-4.0.2/ext/gd'
    make[1]: *** [all-recursive] Error 1
    make[1]: Leaving directory `/tmp/download/php-4.0.2/ext'
    make: *** [all-recursive] Error 1
  2. #2
  3. No Profile Picture
    Devshed Newbie (0 - 499 posts)
    What configure options did you give?

    Where is 'gdtopng' or 'gd2copypal'?

    A tarball with 3mb in size could be increased to 300mb in size after compiled. Never place your source in /tmp directory. It doesn't matter you think you have alot of free space in it. Your source should go to /usr/local/src assuming it's not a different slice.

Similar Threads

  1. syntax error on compiling
    By vissen in forum Python Programming
    Replies: 5
    Last Post: February 16th, 2004, 06:08 AM
  2. Codepupil
    By Adachic in forum C Programming
    Replies: 3
    Last Post: February 6th, 2004, 06:50 PM
  3. Replies: 4
    Last Post: January 28th, 2004, 08:29 AM
  4. I don't know what this error message means
    By lcham02 in forum Java Help
    Replies: 2
    Last Post: January 13th, 2004, 11:57 AM
  5. compiling error
    By leviene in forum C Programming
    Replies: 4
    Last Post: January 5th, 2004, 12:48 PM

IMN logo majestic logo threadwatch logo seochat tools logo